{"text_format":"1","workbook":"xlsx","n_sheets":17,"sheets":["Instructions","1-Customer Information","2-Lighting Equipment Entry","Lighting Equipment Savings","LED in Ref. Cases Entry","LED in Ref. Cases Savings","Occup. Sensors-Photocells Entry","Occup. Snsrs-Photocells Savings","Financial Summary","Terms and Conditions","Modification Instructions","Revision Log","Rebate Tables","Results","Rebate Questions","Dropdown Menus","Compatibility Report"],"not_rendered":{"charts":2,"images":4,"macros":1,"external_links":2,"defined_names":219,"comments":7,"pivot_tables":0},"unopened":[],"bounds":{"document_bytes":16777216,"sheet_cells":100000,"rows_first":2000,"rows_last":500,"rows_between":2000,"halvings":0,"cell_chars":16384,"cell_head_chars":4096},"cells_cut":0,"cells_raw":0,"read":"whole","date_system":"1900"}

{"sheet":"Instructions","index":0,"n_rows":0,"n_cols":0,"rows_kept":0,"cut":false,"hidden":false,"merged":[]}

{"sheet":"1-Customer Information","index":1,"n_rows":60,"n_cols":11,"rows_kept":60,"cut":false,"hidden":false,"merged":[[58,1,58,7],[55,8,55,11],[58,8,58,11],[43,1,43,7],[43,8,43,11],[55,1,55,7],[49,1,49,11],[52,1,52,5],[52,6,52,8],[52,10,52,11],[24,6,24,8],[23,1,24,1],[27,10,27,11],[33,1,33,7],[36,1,36,7],[33,8,33,11],[36,8,36,11],[22,10,22,11],[18,1,18,5],[9,1,9,5],[9,6,9,11],[12,1,12,5],[12,6,12,8],[15,1,15,5],[15,6,15,8]]}
[]
[]
[]
[]
[]
[]
[]
[]
[]
[]
{"$rows_left_out":51}
{"sheet":"2-Lighting Equipment Entry","index":2,"n_rows":101,"n_cols":256,"rows_kept":101,"cut":false,"hidden":false,"merged":[[7,13,7,14],[21,13,21,14],[42,12,42,13],[38,4,38,5],[37,4,37,5],[7,3,7,12],[36,12,36,13],[37,12,37,13],[21,0,22,4],[31,4,31,5],[23,8,27,11],[32,4,32,5],[23,12,27,13],[21,10,21,11],[37,0,37,1],[31,0,31,1],[38,0,38,1],[41,12,41,13],[4,1,4,3],[33,4,33,5],[5,1,5,3],[39,0,39,1],[39,4,39,5],[36,4,36,5],[35,0,35,1],[34,4,34,5],[36,0,36,1],[35,4,35,5],[7,0,7,2],[34,0,34,1],[32,0,32,1],[33,0,33,1]]}
["REBATE INFORMATION "]
[null,null,null,null,null,null,null,null,null,null,null,null,null,"Form Revision Date:","9.19.2023"]
["LIGHTING EQUIPMENT:"]
[]
["Project Type:",null,null,null,null,"Rebate Code Finder Enabled:","Yes",null,null,null,null,null,"Demand","Energy"]
[null,null,null,null,null,null,null,null,null,null,null,"Rate:",15.52,5.9799999999999999E-2]
[]
["OLD SYSTEM",null,null,"NEW SYSTEM",null,null,null,null,null,null,null,null,null,"REBATE"]
["A","B","C","D","E","F","G","H","I","J","K","L","M","N","O"]
["Old Equipment Code*","Old Equipment Description","Qty.","New Equipment Code*","Match w/line item # from the Invoice ","New Equipment Description (Please submit cut sheet and invoice noting manufacturer and model #)","LED or CFL Bulb/Fixture Wattage\n(if applicable)","Qty.","Annual Hours of Operation *","Is This Space Air Conditioned?   (Select from dropdown menu)","Space Type (Select from dropdown menu)","Is Space Heated by Natural Gas?    (Select from dropdown menu)","Total Equipment Cost\n(not including labor)\n(Unit Cost x H)","Rebate Amount per Equipment*","Total Rebate Amount $\n(H x N) not to exceed (M)"]
{"$rows_left_out":92}
{"sheet":"Lighting Equipment Savings","index":3,"n_rows":98,"n_cols":256,"rows_kept":98,"cut":false,"hidden":false,"merged":[[8,0,8,3],[8,7,8,13],[0,0,0,15],[4,0,4,15],[5,1,5,7],[6,8,6,12],[6,1,6,5],[6,13,6,15],[8,14,8,15],[25,4,25,5],[25,14,25,15],[23,4,23,5],[23,11,23,12],[28,14,28,15],[27,14,27,15]]}
["ENERGY & COST SAVINGS"]
[null,null,"Demand","Energy",null,null,null,null,null,null,null,null,null,null,"Form Revision Date:","2014-02-13"]
[null,"Rate",{"$f":"Demand","v":15.52},{"$f":"Energy","v":5.9799999999999999E-2}]
[]
["LIGHTING EQUIPMENT:"]
[]
[null,"OLD SYSTEM",null,null,null,null,null,null,"NEW SYSTEM",null,null,null,null,"SAVINGS"]
[]
["OLD SYSTEM",null,null,null,null,null,null,"NEW SYSTEM",null,null,null,null,null,null,"REBATE  "]
["A"]
{"$rows_left_out":89}
{"sheet":"LED in Ref. Cases Entry","index":4,"n_rows":99,"n_cols":256,"rows_kept":99,"cut":false,"hidden":false,"merged":[[0,0,0,11],[2,0,2,11],[5,1,5,3],[7,0,7,2],[7,10,7,11],[7,3,7,4],[7,5,7,9],[9,0,9,1],[8,0,8,1],[21,0,21,1],[22,0,22,1],[27,10,27,11],[26,10,26,11],[18,0,18,4],[18,10,18,11],[19,0,19,9],[20,8,24,9],[20,10,24,11]]}
["REBATE INFORMATION "]
[null,null,null,null,null,null,null,null,null,"Form Revision Date:","2014-02-13"]
["LIGHTING EQUIPMENT:"]
[]
["Project Type:",null,null,null,null,"Rebate Code Finder Enabled:","Yes"]
[]
[]
["CASE INFORMATION",null,null,"EXISTING LIGHTING",null,"LED LIGHTING",null,null,null,null,"REBATE"]
["A",null,"B","C","D","E","F","G","H","I","J","K"]
["Case Manufacturer/Description           (ex. \"Zero Zone - pizza case #1\")",null,"Case Door Quantity (converted to LED)","Code                (from Lighting Tables)*","Qty.","Code                (from Lighting Tables)*","LED Wattage per strip (watts)","Qty.","Annual Hours of Operation#","Total Equipment Cost\n(excluding labor)\n(Unit Cost x G)","Rebate Amount per Equipment*","Total Rebate Amount $\n(B x J)"]
{"$rows_left_out":90}
{"sheet":"LED in Ref. Cases Savings","index":5,"n_rows":89,"n_cols":256,"rows_kept":89,"cut":false,"hidden":false,"merged":[[24,14,24,16],[19,4,19,5],[19,10,19,11],[21,4,21,5],[21,15,21,16],[21,9,21,14],[23,14,23,16],[1,10,1,12],[0,0,0,16],[6,0,6,16],[9,0,9,1],[8,7,8,11],[8,0,8,5],[8,12,8,16]]}
["ENERGY COSTS & SAVINGS"]
[null,null,"Demand","Energy",null,null,null,null,null,null,"Form Revision Date:",null,null,null,"2014-02-13"]
[null,"Rate",{"$f":"Demand","v":15.52},{"$f":"Energy","v":5.9799999999999999E-2}]
[]
[]
[]
["LIGHTING EQUIPMENT:"]
[]
["EXISTING LIGHTING",null,null,null,null,null,null,"LED LIGHTING",null,null,null,null,"SAVINGS"]
["Old Equipment Description",null,"Old Equipment Fixture Watts","Qty","Old Equipment kW","Old Equipment kWh","Annual Hours of Operation","Case Manufacturer/Description           (ex. \"Zero Zone - pizza case #1\")","LED Wattage Per Strip","Qty","New Equipment kW","New Equipment kWh","Lighting kW","Lighting kWh","kW","kWh","$"]
{"$rows_left_out":80}
{"sheet":"Occup. Sensors-Photocells Entry","index":6,"n_rows":101,"n_cols":256,"rows_kept":101,"cut":false,"hidden":false,"merged":[[2,0,2,13],[0,0,0,13],[25,7,29,11],[23,0,23,5],[7,0,7,5],[28,0,28,1],[27,0,27,1],[26,0,26,1],[25,0,25,1],[25,2,25,3],[23,7,23,11],[32,12,32,13],[31,12,31,13],[24,0,24,5],[7,6,7,10],[7,11,7,13],[22,12,22,13],[23,12,23,13],[25,12,29,13],[30,0,30,1],[29,0,29,1],[30,2,30,3],[22,7,22,10],[29,2,29,3],[28,2,28,3],[27,2,27,3],[26,2,26,3]]}
["REBATE INFORMATION"]
[null,null,null,null,null,null,null,null,null,null,null,null,{"$f":"'2-Lighting Equipment Entry'!L2","v":0},"2017-05-25"]
["OCCUPANCY SENSORS/PHOTOCELLS:"]
["Project Type:"]
[null,null,null,null,null,"Rebate Code Finder Enabled:","Yes"]
[null,null,null,null,null,"Is equipment to be controlled new equipment included in the Lighting Equipment Entry sheet?","Yes"]
[]
["CONTROLLED EQUIPMENT",null,null,null,null,null,"OCCUPANCY SENSORS/PHOTOCELLS",null,null,null,null,"REBATE  "]
["A","B","C","D","E","F","G","H","I","J","K","L","M","N"]
["Equipment Code*","Controlled Equipment Description","Average Wattage (total wattage/ # fixtures)","Low-Wattage Fluorescent Lamps?             (if applicable)","Qty. Controlled by Sensors/ Photocells","Annual Hours of Operation","Equipment Code","Sensor/Photocell Description","Qty.","Is This Space Air Conditioned?","% of Time Lights Off**","Total Cost of Sensors/ Photocells","Rebate Amount per Sensor /Photocell","Total Rebate Amount\n( I x M )"]
{"$rows_left_out":92}
{"sheet":"Occup. Snsrs-Photocells Savings","index":7,"n_rows":101,"n_cols":254,"rows_kept":101,"cut":false,"hidden":false,"merged":[[24,14,24,15],[25,14,25,15],[0,0,0,15],[6,0,6,3],[4,0,4,15],[6,14,6,15],[6,4,6,7]]}
["ENERGY & COST SAVINGS"]
[null,"Demand","Energy"]
["Rate",{"$f":"Demand","v":15.52},{"$f":"Energy","v":5.9799999999999999E-2}]
[]
["OCCUPANCY SENSORS/PHOTOCELLS:"]
[]
["CONTROLLED EQUIPMENT",null,null,null,"OCCUPANCY SENSORS/PHOTOCELLS",null,null,null,null,null,null,null,null,null,"SAVINGS"]
["A","B","C","D","E","F","G","H",null,null,null,null,null,null,"I","J"]
["Equipment Code*","Controlled Equipment Description","Qty. Controlled by Sensors/ Photocells","Annual Hours of Operation","Equipment Code","Sensor/Photocell Description","Qty.","% of Time Lights Off","Equipment Watts (Hidden)","Existing KW\n(Hidden)","Existing kWh\n(Hidden)","Existing $\n(Hidden)","New kWh\n(Hidden)","New $\n(Hidden)","kWh","$"]
[{"$f":"'Occup. Sensors-Photocells Entry'!A11","v":0},{"$f":"IF(ISERROR(INDEX(Description,MATCH(A10,Code,0))),\"\",INDEX(Description,MATCH(A10,Code,0)))","v":""},{"$f":"'Occup. Sensors-Photocells Entry'!E11","v":0},{"$f":"'Occup. Sensors-Photocells Entry'!F11","v":0},{"$f":"'Occup. Sensors-Photocells Entry'!G11","v":0},{"$f":"IF(ISERROR(INDEX(Description,MATCH(E10,Code,0))),\"\",INDEX(Description,MATCH(E10,Code,0)))","v":""},{"$f":"'Occup. Sensors-Photocells Entry'!I11","v":0},{"$f":"'Occup. Sensors-Photocells Entry'!K11","v":0},{"$f":"IF(INDEX(Watts,MATCH(A10,Code,0))=\"N/A\",'Occup. Sensors-Photocells Entry'!C11,INDEX(Watts,MATCH(A10,Code,0)))","v":{"$error":"#N/A"}},{"$f":"IF(ISERROR(C10*I10/1000),\"\",C10*I10/1000)","v":""},{"$f":"IF(ISERROR(C10*I10*D10/1000),\"\",C10*I10*D10/1000)","v":""},{"$f":"IF(ISERROR(K10*Energy),\"\",K10*Energy)","v":""},{"$f":"IF(ISERROR((1-H10)*K10),\"\",(1-H10)*K10)","v":""},{"$f":"IF(ISERROR(M10*Energy),\"\",M10*Energy)","v":""},{"$f":"IF(ISERROR(C10*D10*I10/1000*H10),\"\",C10*D10*I10/1000*H10)","v":""},{"$f":"IF(ISERROR(O10*Energy),\"\",O10*Energy)","v":""}]
{"$rows_left_out":92}
{"sheet":"Financial Summary","index":8,"n_rows":53,"n_cols":8,"rows_kept":53,"cut":false,"hidden":false,"merged":[[36,1,36,8],[3,3,3,4],[5,3,5,4],[7,1,7,8],[27,1,27,8]]}
[]
[]
[]
[null,null,null,{"$f":"CustomerName","v":0}]
[]
[null,null,null,{"$f":"CustomerInstallAddress","v":0}]
[]
[null,"ENERGY SAVINGS SUMMARY:"]
[null,null,null,"Current System","Proposed System","Savings"]
[null,null,"Annual Energy Cost",{"$f":"IF(Included=\"No\",OldLightingEnergyCost+OldSensorEnergyCost+OldLEDLightingEnergyCost,OldLightingEnergyCost+OldLEDLightingEnergyCost)","v":0},{"$f":"IF(Included=\"No\",NewLightingEnergyCost+NewSensorEnergyCost+NewLEDLightingCost,NewLightingEnergyCost+NewLEDLightingCost)","v":0},{"$f":"D10-E10","v":0}]
{"$rows_left_out":44}
{"sheet":"Terms and Conditions","index":9,"n_rows":2,"n_cols":1,"rows_kept":2,"cut":false,"hidden":false,"merged":[[0,0,0,2],[1,0,2,3],[3,0,3,2]]}
["SECTION G.  TERMS AND CONDITIONS"]
["1.   ELIGIBILITY\nRebates are available to non-residential electric customers of Austin Utilities, Owatonna Public Utilities, and Rochester Public Utilities (herein referred to as The Utility). All products must be in use in facilities in The Utility service territory. Rebates are for installed equipment only. For lighting retrofit systems to be eligible, they must show a net reduction in kWh usage from that of the existing lighting system.\n2.   APPLICATION\nProgram is offered January 1 through December 31 of the respective calendar year. Due  to  limited  funding,  this  rebate  offer  can  be  changed  or withdrawn at any time without notice and is available on a first-come, first-served basis. The entire rebate application must be read and filled out completely or application will be returned.\n3.   INSPECTION AND VERIFICATION\nThe Utility reserves the right to inspect the customer’s facility through on-site visits before and after new equipment installation to verify rebate eligibility. The Utility reminds you to follow all local permitting and building code ordinances.\n4.   INSTALLATION AND REBATE AMOUNTS\nQualifying energy-efficient equipment installed and operational within six (6) months of the date of purchase are eligible for rebate. Additional time may be granted subject to the Utility’s pre-approval. In no case will the rebate paid by The Utility exceed the purchase price of the equipment. The maximum rebate amount is $100,000 per customer location per technology per year.\n5.   INVOICE AND PAYMENT\nFollowing inspection and verification (see #3) and completed installation, the customer must notify The Utility and submit original invoices specifying the quantity, model number and individual price of all materials purchased, the date ordered, installation costs, and applicable taxes. After satisfactory review of the application and invoices, a rebate check or bill credit will be issued to the customer. Vendors or contractors are not eligible to receive their customer’s rebate. Please allow 6-10 weeks from the date of application submission for delivery of rebate check or bill credit. The Utility reserves the right to apply the rebate to past due accounts.\n6.   QUALIFYING EQUIPMENT Exit Signs:\nOnly new exit signs that replace incandescent or CFL exit signs qualify. All new exit signs must meet UL-924 requirements. Exit signs must have a usage level less than 5 watts. New exit signs must meet local fire codes. Retrofit kits are not eligible.\nLED Lighting in Enclosed Refrigerated Display Cases:\n• Applicable to low and medium temperature enclosed display cases with access by customers (open display cases and closed rear-entry deli cases excluded from this prescriptive program).\n• For existing case lighting replacement, LED lighting system must replace a fluorescent lighting system and the existing fluorescent fixture end connectors and ballasts must be permanently removed and properly disposed of.\n• For new cases, LED lighting system must be installed in lieu of a fluorescent lighting system.\n• LED lighting system must be a permanently installed luminaire.\n• LED lighting system color rendering index (CRI) must be equal to or greater than 70.\n• LEDs must maintain no less than 70% of initial lumen output at 50,000 hours of operation.\n• Manufacturer’s warranty must be a minimum of 3 years and must include luminaires, mounting hardware, power supplies, and LEDs.\n• The power supply must meet the following requirements:\n– Efficiency of at least 85% at 120 volts.\n– Power factor of at least 0.9.\n– Total harmonic distortion (THD) of 20% or less.\nLED or Fluorescent Lamps and Fixtures with Integrated Occupancy Sensors:\nTo qualify, the occupancy sensor must be permanently integrated into the lamp or fixture by the manufacturer (non-removable). Integrated occupancy sensor rebates apply to sensors permanently integrated to LED or fluorescent lamps and fixtures only. Only retrofit projects qualify for additional integrated occupancy sensor rebates. Occupancy sensors are required for new construction by code.\nOccupancy Sensors and Photocells:\nOnly photocells are eligible for new construction rebates. Occupancy sensors are required for new construction by code.\n7.   TAX INFORMATION\nThe Utility will not be responsible for any tax liability imposed as a result of the rebate payment(s). Customers are advised to consult their tax advisors for details.\n8.   DISCLAIMER\nThe Utility does not guarantee that the implementation of energy-efficient measures or use of the equipment purchased or installed pursuant to this program will result in energy or cost savings. The Utility makes no warranties, expressed or implied, with respect to any equipment purchased or installed including, but not limited to, any warrant of merchantability or fitness for purpose. In no event shall The Utility be liable for any incidental or consequential damages. Customers are solely responsible for the proper disposal of existing equipment. Consult the Minnesota Pollution Control Agency (MPCA) office for details at 800.657.3864.\n9.   ENDORSEMENT\nThe Utility does not endorse any particular vendor, manufacturer, product, or system in promoting this rebate program. Listing a vendor or product does not constitute an endorsement, nor does it imply that unlisted vendors or products are deficient or defective in any way.\n10. PRIVACY\nInformation contained in this rebate application may be shared with the Minnesota Department of Commerce and our co-op partners and also may be used in our advertising efforts with your permission as granted in Section B of this rebate application."]

{"sheet":"Modification Instructions","index":10,"n_rows":14,"n_cols":1,"rows_kept":14,"cut":false,"hidden":true,"merged":[]}
["This page provides some explanation of how to update the tables when rebates, etc. change."]
[]
["If a description, code, rebate $, or watts for an existing measure need to be changed, it can be changed on the \"Results\" sheet.  Use \"find\", filter, or sort to locate the "]
["measure that needs to be changed.  You can change any parameter except for those in the \"result\" column.  This is the designator that the"]
["rebate code finder uses to locate the appropriate item."]
[]
["If an entirely new measure is to be added, it will be necessary to add it to the\"Results\" sheet with a new result### and also add it to the \"Rebate Tables\" sheet.  The rebate finder macro, starts with the values shown in"]
["\"Node1\"; note that selecting an item in Node1 will direct you to another node.  The cells ranges that contain the values to be displayed from each node "]
["are named \"NodeXXXTable\", where XXX is the node number.  The rebate finder continues to branch from node to node based on the selections the user"]
["makes in the window until it eventual reaches a \"Result###\"; this identifier is used to pull up the appropriate measure information from the \"Result\" sheet."]
{"$rows_left_out":5}
{"sheet":"Revision Log","index":11,"n_rows":58,"n_cols":3,"rows_kept":58,"cut":false,"hidden":true,"merged":[]}
["Date","Initials","Description of Changes"]
["2009-04-09","REW","Corrected problem with Demand and Energy rate shown on the financial Summary Sheet.  Deleted Hours of Operation and Facility Square foot questions from Customer Information Sheet.  Set default Demand and Energy rate = 0, and added comments."]
["2009-06-25","REW","Added Instructions Sheet.  Corrected Simple Payback Formula on Financial Summary Sheet. Corrected description for Code 1407, Cold Cathode Lamps."]
["2009-08-20","VMC","Updated Type of Business list, How Did You Hear List, Account Number format, phone number format and removed fax number. "]
["2009-10-20","REW","Added new lighting codes, and associated data and tables to match those in SMMPA Lighting Table for New Equipment dated 9/3/2009 and SMMPA Lighting Tables for Existing Equipment dated 8/3/2009.  Last Result # used is Result447"]
["2009-10-20","REW","Added new Terms and Conditions page."]
["2009-11-04","REW","Added T12 Bonus Rebate.  When it is removed later, must remember to add that row back to the rebate finder and also add the formulas back in on the lighting savings sheet."]
["2010-03-12","VMC","Updated Low-Wattage 28 w 4' lamp T8 to reflect the changed rebate amount. ($0.75 to $1.00) Updated codes to 475 and 476"]
["2010-03-15","VMC","Added Low-Wattage 25 w 4' lamp T8 to reflect the changed rebate amount. ($0.75 to $1.50) Added codes 477 and 488"]
["2010-04-06","VMC","Added new lighting codes, and associated data and tables to match those in SMMPA Lighting Table for New Equipment dated 2/21/2010 and SMMPA Lighting Tables for Existing Equipment dated 2/21/2010.  Last Result # used is Result465"]
{"$rows_left_out":49}
{"sheet":"Rebate Tables","index":12,"n_rows":225,"n_cols":12,"rows_kept":225,"cut":false,"hidden":true,"merged":[]}
["Node1",null,"Node26",null,"Node51",null,"Node76",null,"Node101",null,"Node130"]
["Existing/Base Incandescent Lamps","Node29","1 Lamp","Result54","LED or Flourescent Lamp Fixture ≥ 15w with Integrated Occupancy Sensor","Result722","1 lamp","Result250","1 Lamp","Result343","35w HPS Fixture","Result141"]
["Existing/Base Compact Fluorescent Lamps (1 piece)","Node53","2 Lamps","Result55","LED or Flourescent Lamp Fixture ≥ 50w with Integrated Occupancy Sensor","Result724","2 lamps","Result251","2 Lamps","Result344","50w HPS Fixture","Result142"]
["Existing T12 Fluorescent Lamps And Fixtures With Electronic Ballasts","Node2",null,null,"LED or Flourescent Lamp Fixture ≥ 100w with Integrated Occupancy Sensor","Result726","3 lamps","Result252","3 Lamps","Result444","70w HPS Fixture","Result143"]
["Existing T8 and Super T8 Fluorescent Lamps and Fixtures with Electronic Ballasts","Node69","Node27",null,null,null,"4 lamps","Result253",null,null,"100w HPS Fixture","Result144"]
["Existing/Base T8 Lamps","Node91","1 Lamp","Result56",null,null,null,null,"Node102",null,"150w HPS Fixture","Result155"]
["Existing/Base T5 Lamps","Result466","2 Lamps","Result57",null,null,"Node77",null,"1 Lamp","Result345","200w HPS Fixture","Result156"]
["Existing/Base Mercury Vapor Fixtures","Node93","3 Lamps","Result58",null,null,"1 lamp","Result254","2 Lamps","Result346","250w HPS Fixture","Result157"]
["Existing/Base Metal Halide Fixtures","Node94",null,null,null,null,"2 lamps","Result255",null,null,"310w HPS Fixture","Result158"]
["Existing/Base Metal Halide Lamps","Node123","Node28",null,"Node52",null,null,null,"Node103",null,"400w HPS Fixture","Result159"]
{"$rows_left_out":216}
{"sheet":"Results","index":13,"n_rows":557,"n_cols":5,"rows_kept":557,"cut":false,"hidden":true,"merged":[]}
["Result 520","Code","Description","Wattage","Rebate"]
["Result1",8000,"2' - F20T12 1-Lamp",28]
["Result10",8009,"3' - F30T12 25W 2-Lamp",63]
["Result100",8110,"50W MH 1-Lamp Fixture",62]
["Result101",909,"70W MH 1-Lamp Fixture",92]
["Result102",913,"100W MH 1-Lamp Fixture",129]
["Result103",8119,"150W PS MH 1-Lamp (magnetic ballast)",173,25]
["Result104",8121,"175W PS MH 1-Lamp (magnetic ballast)",189,25]
["Result105",971,"200W PS MH 1-Lamp (magnetic ballast)",232,40]
["Result106",8123,"250W PS MH 1-Lamp (magnetic ballast)",290,40]
{"$rows_left_out":548}
{"sheet":"Rebate Questions","index":14,"n_rows":138,"n_cols":6,"rows_kept":138,"cut":false,"hidden":true,"merged":[]}
["Node","Question 1","Question 2","Question 3","Question 4","Questions 5"]
["Node1","Equipment Category"]
["Node2","Equipment Category","Lamp Length"]
["Node3","Equipment Category","Lamp Length","Description"]
["Node4","Equipment Category","Lamp Length","Description","Number Of Lamps"]
["Node5","Equipment Category","Lamp Length","Description"]
["Node6","Equipment Category","Lamp Length","Description","Number Of Lamps"]
["Node7","Equipment Category","Lamp Length","Description","Number Of Lamps"]
["Node8","Equipment Category","Lamp Length","Description"]
["Node9","Equipment Category","Lamp Length","Description","Number Of Lamps"]
{"$rows_left_out":129}
{"sheet":"Dropdown Menus","index":15,"n_rows":4,"n_cols":2,"rows_kept":4,"cut":false,"hidden":true,"merged":[]}
["Yes or No","Space Type"]
["Yes","Interior"]
["No","Exterior"]
[null,"Exterior 24/7"]

{"sheet":"Compatibility Report","index":16,"n_rows":10,"n_cols":6,"rows_kept":10,"cut":false,"hidden":true,"merged":[]}
[null,"Compatibility Report for 2018 Interactive Lighting Rebate Application v1.8 05.07.2018.xls"]
[null,"Run on 12/10/2018 11:15"]
[]
[null,"If the workbook is saved in an earlier file format or opened in an earlier version of Microsoft Excel, the listed features will not be available."]
[]
[null,"Minor loss of fidelity",null,null,"# of occurrences","Version"]
[]
[null,"Some formulas in this workbook are linked to other workbooks that are closed. When these formulas are recalculated in earlier versions of Excel without opening the linked workbooks, characters beyond the 255-character limit cannot be returned.",null,null,"13\nDefined Names","Excel 97-2003"]
[]
[null,"Some cells or styles in this workbook contain formatting that is not supported by the selected file format. These formats will be converted to the closest format available.",null,null,7,"Excel 97-2003"]